Search
Submitted (UTC) Testcase Outcome Item Note Details Groups Logs
2020-01-21 11:49:20.366035 compose.install_blivet_no_swap FAILED Fedora-Server-dvd-ppc64le-Rawhide-20200117.n.0.iso disk_custom_blivet_no_swap module failed Details In 5 groups → Link →
2020-01-21 11:49:16.618605 compose.server_cockpit_basic FAILED Fedora-Server-dvd-x86_64-Rawhide-20200117.n.0.iso server_cockpit_basic module failed Details In 5 groups → Link →
2020-01-21 11:48:29.610997 update.advisory_boot PASSED FEDORA-2020-7992b6bf2a Details In 3 groups → Link →
2020-01-21 11:48:07.393289 update.base_services_start PASSED FEDORA-2020-7992b6bf2a Details In 3 groups → Link →
2020-01-21 11:48:04.582129 compose.install_arm_image_deployment_upload FAILED Fedora-Minimal-armhfp-Rawhide-20200117.n.0-sda.raw.xz install_arm_image_deployment module failed Details In 5 groups → Link →
2020-01-21 11:47:28.327137 update.base_update_cli PASSED FEDORA-2020-7992b6bf2a Details In 3 groups → Link →
2020-01-21 11:47:25.774237 update.base_selinux PASSED FEDORA-2020-c32e4b271c Details In 3 groups → Link →
2020-01-21 11:46:46.435002 update.base_service_manipulation PASSED FEDORA-2020-c32e4b271c Details In 3 groups → Link →
2020-01-21 11:46:43.800851 compose.release_identification PASSED Fedora-Server-dvd-ppc64le-Rawhide-20200117.n.0.iso Details In 5 groups → Link →
2020-01-21 11:46:13.223069 compose.install_arabic_language INFO Fedora-Server-dvd-ppc64le-Rawhide-20200117.n.0.iso Details In 5 groups → Link →
2020-01-21 11:46:11.092653 fedora-ci.koji-build.tier0.functional FAILED retrace-server-1.20.0-1.fc32 Details Link →
2020-01-21 11:46:05.613393 compose.install_simple_encrypted PASSED Fedora-Server-dvd-x86_64-Rawhide-20200117.n.0.iso Details In 5 groups → Link →
2020-01-21 11:45:59.928992 compose.upgrade_server_64bit INFO Fedora-Rawhide-20200117.n.0 Details In 3 groups → Link →
2020-01-21 11:45:59.614227 fedora-ci.koji-build.tier0.functional FAILED retrace-server-1.20.0-1.fc32 Details Link →
2020-01-21 11:45:57.275955 compose.modularity_tests FAILED Fedora-Server-dvd-ppc64le-Rawhide-20200117.n.0.iso modularity_install_module module failed Details In 5 groups → Link →
2020-01-21 11:45:54.896239 update.server_firewall_default PASSED FEDORA-2020-7992b6bf2a Details In 3 groups → Link →
2020-01-21 11:45:51.240965 update.desktop_browser PASSED FEDORA-2020-c32e4b271c Details In 3 groups → Link →
2020-01-21 11:45:12.545571 update.desktop_update_graphical PASSED FEDORA-2020-c32e4b271c Details In 3 groups → Link →
2020-01-21 11:45:00.635145 compose.install_btrfs PASSED Fedora-Server-dvd-ppc64le-Rawhide-20200117.n.0.iso Details In 5 groups → Link →
2020-01-21 11:44:55.548507 compose.install_shrink_ext4 PASSED Fedora-Server-dvd-x86_64-Rawhide-20200117.n.0.iso Details In 5 groups → Link →
"